{"text_format":"1","workbook":"xlsx","n_sheets":2,"sheets":["Sheet1","Sheet2"],"not_rendered":{"charts":0,"images":1,"macros":1,"external_links":0,"defined_names":37,"comments":0,"pivot_tables":0},"unopened":[],"bounds":{"document_bytes":16777216,"sheet_cells":100000,"rows_first":2000,"rows_last":500,"rows_between":2000,"halvings":0,"cell_chars":16384,"cell_head_chars":4096},"cells_cut":0,"cells_raw":0,"read":"whole","date_system":"1900"}

{"sheet":"Sheet1","index":0,"n_rows":38,"n_cols":31,"rows_kept":38,"cut":false,"hidden":false,"merged":[[13,26,13,27],[28,1,29,1],[25,19,26,19],[25,17,26,17],[25,15,26,15],[25,13,26,13],[25,11,26,11],[25,7,26,7],[25,5,26,5],[25,3,26,3],[25,1,26,1],[28,19,29,19],[28,17,29,17],[28,15,29,15],[28,13,29,13],[28,11,29,11],[28,9,29,9],[28,7,29,7],[28,5,29,5],[28,3,29,3],[25,9,26,9],[13,15,14,15],[16,15,17,15],[19,15,20,15],[34,1,35,1],[31,19,32,19],[31,17,32,17],[31,15,32,15],[31,13,32,13],[31,11,32,11],[31,9,32,9],[31,7,32,7],[31,5,32,5],[31,3,32,3],[31,1,32,1],[34,19,35,19],[34,17,35,17],[34,15,35,15],[34,13,35,13],[34,11,35,11],[34,9,35,9],[34,7,35,7],[34,5,35,5],[34,3,35,3],[16,3,17,3],[22,19,23,19],[19,1,20,1],[19,3,20,3],[19,5,20,5],[19,7,20,7],[19,13,20,13],[19,17,20,17],[19,11,20,11],[22,11,23,11],[19,19,20,19],[22,15,23,15],[19,9,20,9],[22,9,23,9],[22,1,23,1],[22,3,23,3],[22,5,23,5],[22,7,23,7],[22,13,23,13],[16,5,17,5],[16,7,17,7],[16,13,17,13],[22,17,23,17],[7,9,8,9],[16,17,17,17],[16,19,17,19],[10,5,11,5],[10,7,11,7],[10,13,11,13],[10,17,11,17],[10,19,11,19],[13,1,14,1],[13,3,14,3],[13,5,14,5],[13,7,14,7],[13,13,14,13],[10,1,11,1],[10,3,11,3],[10,11,11,11],[13,11,14,11],[16,11,17,11],[13,17,14,17],[13,19,14,19],[10,9,11,9],[13,9,14,9],[16,9,17,9],[16,1,17,1],[18,26,18,27],[20,26,20,27],[9,30,10,30],[7,1,8,1],[7,3,8,3],[7,5,8,5],[7,7,8,7],[7,13,8,13],[4,1,5,1],[4,3,5,3],[4,5,5,5],[4,7,5,7],[4,13,5,13],[4,19,5,19],[4,11,5,11],[7,11,8,11],[7,17,8,17],[7,19,8,19],[4,17,5,17],[4,15,5,15],[7,15,8,15],[10,15,11,15],[9,29,10,29],[4,9,5,9]]}
[null,null,"PLC SIMULATOR"]
[]
[null,null,"X5",null,"X6",null,"X7",null,null,null,null,null,null,null,null,null,null,null,"Y1"]
[null,"●","-----| |-----",{"$f":"IF(AND(ISBLANK(D2),ISBLANK(C4)),\"o\",\"●\")","v":"●"},"-----| |-----",{"$f":"IF(AND(ISBLANK(F2),ISBLANK(E4)),\"o\",\"●\")","v":"●"},"-----| |-----",{"$f":"IF(AND(ISBLANK(H2),ISBLANK(G4)),\"o\",\"●\")","v":"●"},"--------------",{"$f":"IF(AND(ISBLANK(J2),ISBLANK(I4)),\"o\",\"●\")","v":"●"},"--------------",{"$f":"IF(AND(ISBLANK(L2),ISBLANK(K4)),\"o\",\"●\")","v":"●"},"--------------",{"$f":"IF(AND(ISBLANK(N2),ISBLANK(M4)),\"o\",\"●\")","v":"●"},"--------------",{"$f":"IF(AND(ISBLANK(P2),ISBLANK(O4)),\"o\",\"●\")","v":"●"},"--------------",{"$f":"IF(AND(ISBLANK(R2),ISBLANK(Q4)),\"o\",\"●\")","v":"●"},"-----(  )-----","●",null,"TAG","TYPE","DESCRIPTION","VALUE",null,"TAG","OPERATE",null,"INSTRUCTION","SYMBOL"]
[null,"|",{"$f":"IF(C3<>\"\",VLOOKUP(C3,$V$5:$X$37,3,0),\"\")","v":"SWITCH 1"},null,{"$f":"IF(E3<>\"\",VLOOKUP(E3,$V$5:$X$37,3,0),\"\")","v":"SWITCH 2"},null,{"$f":"IF(G3<>\"\",VLOOKUP(G3,$V$5:$X$37,3,0),\"\")","v":"SWITCH 3"},null,{"$f":"IF(I3<>\"\",VLOOKUP(I3,$V$5:$X$37,3,0),\"\")","v":""},null,{"$f":"IF(K3<>\"\",VLOOKUP(K3,$V$5:$X$37,3,0),\"\")","v":""},null,{"$f":"IF(M3<>\"\",VLOOKUP(M3,$V$5:$X$37,3,0),\"\")","v":""},null,{"$f":"IF(O3<>\"\",VLOOKUP(O3,$V$5:$X$37,3,0),\"\")","v":""},null,{"$f":"IF(Q3<>\"\",VLOOKUP(Q3,$V$5:$X$37,3,0),\"\")","v":""},null,{"$f":"IF(S3<>\"\",VLOOKUP(S3,$V$5:$X$37,3,0),\"\")","v":"AND OUTPUT"},"|",null,"X1","N/O PUSHBUTTON",null,false,null,"X1",null,null,"CHECK IF TRUE","-----| |-----"]
[null,null,null,null,"X5",null,null,null,null,null,null,null,null,null,null,null,null,null,"Y2",null,null,"X2","N/O PUSHBUTTON",null,false,null,"X2",null,null,"CHECK IF FALSE","----|/|----"]
[null,"●","--------------",{"$f":"IF(AND(ISBLANK(D5),ISBLANK(C7)),\"o\",\"●\")","v":"●"},"-----| |-----",{"$f":"IF(AND(ISBLANK(F5),ISBLANK(E7)),\"o\",\"●\")","v":"●"},"--------------",{"$f":"IF(AND(ISBLANK(H5),ISBLANK(G7)),\"o\",\"●\")","v":"●"},"--------------",{"$f":"IF(AND(ISBLANK(J5),ISBLANK(I7)),\"o\",\"●\")","v":"●"},"--------------",{"$f":"IF(AND(ISBLANK(L5),ISBLANK(K7)),\"o\",\"●\")","v":"●"},"--------------",{"$f":"IF(AND(ISBLANK(N5),ISBLANK(M7)),\"o\",\"●\")","v":"●"},"--------------",{"$f":"IF(AND(ISBLANK(P5),ISBLANK(O7)),\"o\",\"●\")","v":"●"},"--------------",{"$f":"IF(AND(ISBLANK(R5),ISBLANK(Q7)),\"o\",\"●\")","v":"●"},"-----(  )-----","●",null,"X3","N/C PUSHBUTTON",null,true,null,"X3",null,null,"HORIZ LINK","--------------"]
[null,"|",{"$f":"IF(C6<>\"\",VLOOKUP(C6,$V$5:$X$37,3,0),\"\")","v":""},"|",{"$f":"IF(E6<>\"\",VLOOKUP(E6,$V$5:$X$37,3,0),\"\")","v":"SWITCH 1"},"|",{"$f":"IF(G6<>\"\",VLOOKUP(G6,$V$5:$X$37,3,0),\"\")","v":""},null,{"$f":"IF(I6<>\"\",VLOOKUP(I6,$V$5:$X$37,3,0),\"\")","v":""},null,{"$f":"IF(K6<>\"\",VLOOKUP(K6,$V$5:$X$37,3,0),\"\")","v":""},null,{"$f":"IF(M6<>\"\",VLOOKUP(M6,$V$5:$X$37,3,0),\"\")","v":""},null,{"$f":"IF(O6<>\"\",VLOOKUP(O6,$V$5:$X$37,3,0),\"\")","v":""},null,{"$f":"IF(Q6<>\"\",VLOOKUP(Q6,$V$5:$X$37,3,0),\"\")","v":""},null,{"$f":"IF(S6<>\"\",VLOOKUP(S6,$V$5:$X$37,3,0),\"\")","v":"OR OUTPUT"},"|",null,"X4","N/C PUSHBUTTON",null,true,null,"X4",null,null,"COIL","-----(  )-----"]
[null,null,null,null,"X6",null,null,null,null,null,null,null,null,null,null,null,null,null,null,null,null,"X5","ON/OFF SWITCH","SWITCH 1",false,null,"X5",null,null,"TIMER","--[TMR]--"]
[null,"●",null,{"$f":"IF(AND(ISBLANK(D8),ISBLANK(C10)),\"o\",\"●\")","v":"●"},"-----| |-----",{"$f":"IF(AND(ISBLANK(F8),ISBLANK(E10)),\"o\",\"●\")","v":"●"},null,{"$f":"IF(AND(ISBLANK(H8),ISBLANK(G10)),\"o\",\"●\")","v":"o"},null,{"$f":"IF(AND(ISBLANK(J8),ISBLANK(I10)),\"o\",\"●\")","v":"o"},null,{"$f":"IF(AND(ISBLANK(L8),ISBLANK(K10)),\"o\",\"●\")","v":"o"},null,{"$f":"IF(AND(ISBLANK(N8),ISBLANK(M10)),\"o\",\"●\")","v":"o"},null,{"$f":"IF(AND(ISBLANK(P8),ISBLANK(O10)),\"o\",\"●\")","v":"o"},null,{"$f":"IF(AND(ISBLANK(R8),ISBLANK(Q10)),\"o\",\"●\")","v":"o"},null,"●",null,"X6","ON/OFF SWITCH","SWITCH 2",false,null,"X6",null,null,"VERTICAL LINK","|"]
[null,"|",{"$f":"IF(C9<>\"\",VLOOKUP(C9,$V$5:$X$37,3,0),\"\")","v":""},"|",{"$f":"IF(E9<>\"\",VLOOKUP(E9,$V$5:$X$37,3,0),\"\")","v":"SWITCH 2"},"|",{"$f":"IF(G9<>\"\",VLOOKUP(G9,$V$5:$X$37,3,0),\"\")","v":""},null,{"$f":"IF(I9<>\"\",VLOOKUP(I9,$V$5:$X$37,3,0),\"\")","v":""},null,{"$f":"IF(K9<>\"\",VLOOKUP(K9,$V$5:$X$37,3,0),\"\")","v":""},null,{"$f":"IF(M9<>\"\",VLOOKUP(M9,$V$5:$X$37,3,0),\"\")","v":""},null,{"$f":"IF(O9<>\"\",VLOOKUP(O9,$V$5:$X$37,3,0),\"\")","v":""},null,{"$f":"IF(Q9<>\"\",VLOOKUP(Q9,$V$5:$X$37,3,0),\"\")","v":""},null,{"$f":"IF(S9<>\"\",VLOOKUP(S9,$V$5:$X$37,3,0),\"\")","v":""},"|",null,"X7","ON/OFF SWITCH","SWITCH 3",false,null,"X7"]
[null,null,null,null,"X7",null,null,null,null,null,null,null,null,null,null,null,null,null,null,null,null,"X8","ON/OFF SWITCH",null,false,null,"X8"]
[null,"●",null,{"$f":"IF(AND(ISBLANK(D11),ISBLANK(C13)),\"o\",\"●\")","v":"●"},"-----| |-----",{"$f":"IF(AND(ISBLANK(F11),ISBLANK(E13)),\"o\",\"●\")","v":"●"},null,{"$f":"IF(AND(ISBLANK(H11),ISBLANK(G13)),\"o\",\"●\")","v":"o"},null,{"$f":"IF(AND(ISBLANK(J11),ISBLANK(I13)),\"o\",\"●\")","v":"o"},null,{"$f":"IF(AND(ISBLANK(L11),ISBLANK(K13)),\"o\",\"●\")","v":"o"},null,{"$f":"IF(AND(ISBLANK(N11),ISBLANK(M13)),\"o\",\"●\")","v":"o"},null,{"$f":"IF(AND(ISBLANK(P11),ISBLANK(O13)),\"o\",\"●\")","v":"o"},null,{"$f":"IF(AND(ISBLANK(R11),ISBLANK(Q13)),\"o\",\"●\")","v":"o"},null,"●",null,"Y1","DIGITAL OUTPUT","AND OUTPUT",false]
[null,"|",{"$f":"IF(C12<>\"\",VLOOKUP(C12,$V$5:$X$37,3,0),\"\")","v":""},null,{"$f":"IF(E12<>\"\",VLOOKUP(E12,$V$5:$X$37,3,0),\"\")","v":"SWITCH 3"},null,{"$f":"IF(G12<>\"\",VLOOKUP(G12,$V$5:$X$37,3,0),\"\")","v":""},null,{"$f":"IF(I12<>\"\",VLOOKUP(I12,$V$5:$X$37,3,0),\"\")","v":""},null,{"$f":"IF(K12<>\"\",VLOOKUP(K12,$V$5:$X$37,3,0),\"\")","v":""},null,{"$f":"IF(M12<>\"\",VLOOKUP(M12,$V$5:$X$37,3,0),\"\")","v":""},null,{"$f":"IF(O12<>\"\",VLOOKUP(O12,$V$5:$X$37,3,0),\"\")","v":""},null,{"$f":"IF(Q12<>\"\",VLOOKUP(Q12,$V$5:$X$37,3,0),\"\")","v":""},null,{"$f":"IF(S12<>\"\",VLOOKUP(S12,$V$5:$X$37,3,0),\"\")","v":""},"|",null,"Y2","DIGITAL OUTPUT","OR OUTPUT",false,null,"TIMER SETTINGS"]
[null,null,null,null,null,null,null,null,null,null,null,null,null,null,null,null,null,null,null,null,null,"Y3","DIGITAL OUTPUT",null,false,null,"SET(sec)",5]
{"$rows_left_out":24}
{"sheet":"Sheet2","index":1,"n_rows":38,"n_cols":19,"rows_kept":38,"cut":false,"hidden":false,"merged":[]}
[]
[null,true,null,null,null,null,null,null,null,null,null,null,null,null,null,null,null,null,"),\"ERROR\")"]
[null,null,{"$f":"IF(C4=\"\",\"\",\"AND(\"&C4)","v":"AND(FALSE,"},{"$f":"IF(D4=\"\",\"\",C3&IF(D4=\",\",\"\",D4))","v":"AND(FALSE,"},{"$f":"IF(E4=\"\",\"\",D3&IF(E4=\",\",\"\",E4))","v":"AND(FALSE,FALSE,"},"AND(FALSE,FALSE,","AND(FALSE,FALSE,FALSE,","AND(FALSE,FALSE,FALSE,","AND(FALSE,FALSE,FALSE,1,","AND(FALSE,FALSE,FALSE,1,","AND(FALSE,FALSE,FALSE,1,1,","AND(FALSE,FALSE,FALSE,1,1,","AND(FALSE,FALSE,FALSE,1,1,1,","AND(FALSE,FALSE,FALSE,1,1,1,","AND(FALSE,FALSE,FALSE,1,1,1,1,","AND(FALSE,FALSE,FALSE,1,1,1,1,","AND(FALSE,FALSE,FALSE,1,1,1,1,1",null,{"$f":"IF(Sheet1!S3=\"\",\"\",Sheet1!S3)","v":"Y1"}]
[null,null,{"$f":"IFERROR(IF(Sheet1!C4=\"\",\"\",IF(Sheet1!C4=LINK,\"1,\",IF(Sheet1!C4=CHKON,VLOOKUP(Sheet1!C3,Sheet1!$V$5:$Y$37,4,0),NOT(VLOOKUP(Sheet1!C3,Sheet1!$V$5:$Y$37,4,0)))&\",\")),\"ERR\")","v":"FALSE,"},{"$f":"IF(D5,IF(C7=\"\",\"OR(AND(\",\"1),\"&D6&\"),\"),IF(D2,IF(C4=\"\",\"AND(\",\"1)\"),\",\"))","v":","},{"$f":"IFERROR(IF(Sheet1!E4=\"\",\"\",IF(Sheet1!E4=LINK,\"1,\",IF(Sheet1!E4=CHKON,VLOOKUP(Sheet1!E3,Sheet1!$V$5:$Y$37,4,0),NOT(VLOOKUP(Sheet1!E3,Sheet1!$V$5:$Y$37,4,0)))&\",\")),\"ERR\")","v":"FALSE,"},{"$f":"IF(F5,IF(E7=\"\",\"OR(AND(\",\"1),\"&F6&\"),\"),IF(F2,IF(E4=\"\",\"AND(\",\"1)\"),\",\"))","v":","},{"$f":"IFERROR(IF(Sheet1!G4=\"\",\"\",IF(Sheet1!G4=LINK,\"1,\",IF(Sheet1!G4=CHKON,VLOOKUP(Sheet1!G3,Sheet1!$V$5:$Y$37,4,0),NOT(VLOOKUP(Sheet1!G3,Sheet1!$V$5:$Y$37,4,0)))&\",\")),\"ERR\")","v":"FALSE,"},{"$f":"IF(H5,IF(G7=\"\",\"OR(AND(\",\"1),\"&H6&\"),\"),IF(H2,IF(G4=\"\",\"AND(\",\"1)\"),\",\"))","v":","},{"$f":"IFERROR(IF(Sheet1!I4=\"\",\"\",IF(Sheet1!I4=LINK,\"1,\",IF(Sheet1!I4=CHKON,VLOOKUP(Sheet1!I3,Sheet1!$V$5:$Y$37,4,0),NOT(VLOOKUP(Sheet1!I3,Sheet1!$V$5:$Y$37,4,0)))&\",\")),\"ERR\")","v":"1,"},{"$f":"IF(J5,IF(I7=\"\",\"OR(AND(\",\"1),\"&J6&\"),\"),IF(J2,IF(I4=\"\",\"AND(\",\"1)\"),\",\"))","v":","},{"$f":"IFERROR(IF(Sheet1!K4=\"\",\"\",IF(Sheet1!K4=LINK,\"1,\",IF(Sheet1!K4=CHKON,VLOOKUP(Sheet1!K3,Sheet1!$V$5:$Y$37,4,0),NOT(VLOOKUP(Sheet1!K3,Sheet1!$V$5:$Y$37,4,0)))&\",\")),\"ERR\")","v":"1,"},{"$f":"IF(L5,IF(K7=\"\",\"OR(AND(\",\"1),\"&L6&\"),\"),IF(L2,IF(K4=\"\",\"AND(\",\"1)\"),\",\"))","v":","},{"$f":"IFERROR(IF(Sheet1!M4=\"\",\"\",IF(Sheet1!M4=LINK,\"1,\",IF(Sheet1!M4=CHKON,VLOOKUP(Sheet1!M3,Sheet1!$V$5:$Y$37,4,0),NOT(VLOOKUP(Sheet1!M3,Sheet1!$V$5:$Y$37,4,0)))&\",\")),\"ERR\")","v":"1,"},{"$f":"IF(N5,IF(M7=\"\",\"OR(AND(\",\"1),\"&N6&\"),\"),IF(N2,IF(M4=\"\",\"AND(\",\"1)\"),\",\"))","v":","},{"$f":"IFERROR(IF(Sheet1!O4=\"\",\"\",IF(Sheet1!O4=LINK,\"1,\",IF(Sheet1!O4=CHKON,VLOOKUP(Sheet1!O3,Sheet1!$V$5:$Y$37,4,0),NOT(VLOOKUP(Sheet1!O3,Sheet1!$V$5:$Y$37,4,0)))&\",\")),\"ERR\")","v":"1,"},{"$f":"IF(P5,IF(O7=\"\",\"OR(AND(\",\"1),\"&P6&\"),\"),IF(P2,IF(O4=\"\",\"AND(\",\"1)\"),\",\"))","v":","},{"$f":"IFERROR(IF(Sheet1!Q4=\"\",\"\",IF(Sheet1!Q4=LINK,\"1\",IF(Sheet1!Q4=CHKON,VLOOKUP(Sheet1!Q3,Sheet1!$V$5:$Y$37,4,0),NOT(VLOOKUP(Sheet1!Q3,Sheet1!$V$5:$Y$37,4,0))))),\"ERR\")","v":"1"},{"$f":"IF(Q3=\"\",\"\",\"IFERROR(\"&Q3&$S$2)","v":"IFERROR(AND(FALSE,FALSE,FALSE,1,1,1,1,1),\"ERROR\")"},0]
[null,true,null,{"$f":"Sheet1!D5=VLINK","v":false},null,{"$f":"Sheet1!F5=VLINK","v":false},null,{"$f":"Sheet1!H5=VLINK","v":false},null,{"$f":"Sheet1!J5=VLINK","v":false},null,{"$f":"Sheet1!L5=VLINK","v":false},null,{"$f":"Sheet1!N5=VLINK","v":false},null,{"$f":"Sheet1!P5=VLINK","v":false}]
[null,null,{"$f":"IF(C7=\"\",\"\",\"AND(\"&C7)","v":"AND(1,"},{"$f":"IF(D7=\"\",\"\",C6&IF(D7=\",\",\"\",D7))","v":"AND(1,OR(AND("},{"$f":"IF(E7=\"\",\"\",D6&IF(E7=\",\",\"\",E7))","v":"AND(1,OR(AND(FALSE,"},{"$f":"IF(F7=\"\",\"\",E6&IF(F7=\",\",\"\",F7))","v":"AND(1,OR(AND(FALSE,1),OR(AND(FALSE,1),AND(FALSE,1)),),"},{"$f":"IF(G7=\"\",\"\",F6&IF(G7=\",\",\"\",G7))","v":"AND(1,OR(AND(FALSE,1),OR(AND(FALSE,1),AND(FALSE,1)),),1,"},{"$f":"IF(H7=\"\",\"\",G6&IF(H7=\",\",\"\",H7))","v":"AND(1,OR(AND(FALSE,1),OR(AND(FALSE,1),AND(FALSE,1)),),1,"},{"$f":"IF(I7=\"\",\"\",H6&IF(I7=\",\",\"\",I7))","v":"AND(1,OR(AND(FALSE,1),OR(AND(FALSE,1),AND(FALSE,1)),),1,1,"},{"$f":"IF(J7=\"\",\"\",I6&IF(J7=\",\",\"\",J7))","v":"AND(1,OR(AND(FALSE,1),OR(AND(FALSE,1),AND(FALSE,1)),),1,1,"},{"$f":"IF(K7=\"\",\"\",J6&IF(K7=\",\",\"\",K7))","v":"AND(1,OR(AND(FALSE,1),OR(AND(FALSE,1),AND(FALSE,1)),),1,1,1,"},{"$f":"IF(L7=\"\",\"\",K6&IF(L7=\",\",\"\",L7))","v":"AND(1,OR(AND(FALSE,1),OR(AND(FALSE,1),AND(FALSE,1)),),1,1,1,"},{"$f":"IF(M7=\"\",\"\",L6&IF(M7=\",\",\"\",M7))","v":"AND(1,OR(AND(FALSE,1),OR(AND(FALSE,1),AND(FALSE,1)),),1,1,1,1,"},{"$f":"IF(N7=\"\",\"\",M6&IF(N7=\",\",\"\",N7))","v":"AND(1,OR(AND(FALSE,1),OR(AND(FALSE,1),AND(FALSE,1)),),1,1,1,1,"},{"$f":"IF(O7=\"\",\"\",N6&IF(O7=\",\",\"\",O7))","v":"AND(1,OR(AND(FALSE,1),OR(AND(FALSE,1),AND(FALSE,1)),),1,1,1,1,1,"},{"$f":"IF(P7=\"\",\"\",O6&IF(P7=\",\",\"\",P7))","v":"AND(1,OR(AND(FALSE,1),OR(AND(FALSE,1),AND(FALSE,1)),),1,1,1,1,1,"},{"$f":"IF(Q7=\"\",\"\",P6&IF(Q7=\",\",\"\",Q7))","v":"AND(1,OR(AND(FALSE,1),OR(AND(FALSE,1),AND(FALSE,1)),),1,1,1,1,1,1"},null,{"$f":"IF(Sheet1!S6=\"\",\"\",Sheet1!S6)","v":"Y2"}]
[null,null,{"$f":"IFERROR(IF(Sheet1!C7=\"\",\"\",IF(Sheet1!C7=LINK,\"1,\",IF(Sheet1!C7=CHKON,VLOOKUP(Sheet1!C6,Sheet1!$V$5:$Y$37,4,0),NOT(VLOOKUP(Sheet1!C6,Sheet1!$V$5:$Y$37,4,0)))&\",\")),\"ERR\")","v":"1,"},{"$f":"IF(D8,IF(C10=\"\",\"OR(AND(\",\"1),\"&D9&\"),\"),IF(D5,IF(C7=\"\",\"AND(\",\"1)\"),\",\"))","v":"OR(AND("},{"$f":"IFERROR(IF(Sheet1!E7=\"\",\"\",IF(Sheet1!E7=LINK,\"1,\",IF(Sheet1!E7=CHKON,VLOOKUP(Sheet1!E6,Sheet1!$V$5:$Y$37,4,0),NOT(VLOOKUP(Sheet1!E6,Sheet1!$V$5:$Y$37,4,0)))&\",\")),\"ERR\")","v":"FALSE,"},{"$f":"IF(F8,IF(E10=\"\",\"OR(AND(\",\"1),\"&F9&\"),\"),IF(F5,IF(E7=\"\",\"AND(\",\"1)\"),\",\"))","v":"1),OR(AND(FALSE,1),AND(FALSE,1)),),"},{"$f":"IFERROR(IF(Sheet1!G7=\"\",\"\",IF(Sheet1!G7=LINK,\"1,\",IF(Sheet1!G7=CHKON,VLOOKUP(Sheet1!G6,Sheet1!$V$5:$Y$37,4,0),NOT(VLOOKUP(Sheet1!G6,Sheet1!$V$5:$Y$37,4,0)))&\",\")),\"ERR\")","v":"1,"},{"$f":"IF(H8,IF(G10=\"\",\"OR(AND(\",\"1),\"&H9&\"),\"),IF(H5,IF(G7=\"\",\"AND(\",\"1)\"),\",\"))","v":","},{"$f":"IFERROR(IF(Sheet1!I7=\"\",\"\",IF(Sheet1!I7=LINK,\"1,\",IF(Sheet1!I7=CHKON,VLOOKUP(Sheet1!I6,Sheet1!$V$5:$Y$37,4,0),NOT(VLOOKUP(Sheet1!I6,Sheet1!$V$5:$Y$37,4,0)))&\",\")),\"ERR\")","v":"1,"},{"$f":"IF(J8,IF(I10=\"\",\"OR(AND(\",\"1),\"&J9&\"),\"),IF(J5,IF(I7=\"\",\"AND(\",\"1)\"),\",\"))","v":","},{"$f":"IFERROR(IF(Sheet1!K7=\"\",\"\",IF(Sheet1!K7=LINK,\"1,\",IF(Sheet1!K7=CHKON,VLOOKUP(Sheet1!K6,Sheet1!$V$5:$Y$37,4,0),NOT(VLOOKUP(Sheet1!K6,Sheet1!$V$5:$Y$37,4,0)))&\",\")),\"ERR\")","v":"1,"},{"$f":"IF(L8,IF(K10=\"\",\"OR(AND(\",\"1),\"&L9&\"),\"),IF(L5,IF(K7=\"\",\"AND(\",\"1)\"),\",\"))","v":","},{"$f":"IFERROR(IF(Sheet1!M7=\"\",\"\",IF(Sheet1!M7=LINK,\"1,\",IF(Sheet1!M7=CHKON,VLOOKUP(Sheet1!M6,Sheet1!$V$5:$Y$37,4,0),NOT(VLOOKUP(Sheet1!M6,Sheet1!$V$5:$Y$37,4,0)))&\",\")),\"ERR\")","v":"1,"},{"$f":"IF(N8,IF(M10=\"\",\"OR(AND(\",\"1),\"&N9&\"),\"),IF(N5,IF(M7=\"\",\"AND(\",\"1)\"),\",\"))","v":","},{"$f":"IFERROR(IF(Sheet1!O7=\"\",\"\",IF(Sheet1!O7=LINK,\"1,\",IF(Sheet1!O7=CHKON,VLOOKUP(Sheet1!O6,Sheet1!$V$5:$Y$37,4,0),NOT(VLOOKUP(Sheet1!O6,Sheet1!$V$5:$Y$37,4,0)))&\",\")),\"ERR\")","v":"1,"},{"$f":"IF(P8,IF(O10=\"\",\"OR(AND(\",\"1),\"&P9&\"),\"),IF(P5,IF(O7=\"\",\"AND(\",\"1)\"),\",\"))","v":","},{"$f":"IFERROR(IF(Sheet1!Q7=\"\",\"\",IF(Sheet1!Q7=LINK,\"1\",IF(Sheet1!Q7=CHKON,VLOOKUP(Sheet1!Q6,Sheet1!$V$5:$Y$37,4,0),NOT(VLOOKUP(Sheet1!Q6,Sheet1!$V$5:$Y$37,4,0))))),\"ERR\")","v":"1"},{"$f":"IF(Q6=\"\",\"\",\"IFERROR(\"&Q6&$S$2)","v":"IFERROR(AND(1,OR(AND(FALSE,1),OR(AND(FALSE,1),AND(FALSE,1)),),1,1,1,1,1,1),\"ERROR\")"},0]
[null,true,null,{"$f":"Sheet1!D8=VLINK","v":true},null,{"$f":"Sheet1!F8=VLINK","v":true},null,{"$f":"Sheet1!H8=VLINK","v":false},null,{"$f":"Sheet1!J8=VLINK","v":false},null,{"$f":"Sheet1!L8=VLINK","v":false},null,{"$f":"Sheet1!N8=VLINK","v":false},null,{"$f":"Sheet1!P8=VLINK","v":false}]
[null,null,{"$f":"IF(C10=\"\",\"\",\"AND(\"&C10)","v":""},{"$f":"IF(D10=\"\",\"\",C9&IF(D10=\",\",\"\",D10))","v":"OR(AND("},{"$f":"IF(E10=\"\",\"\",D9&IF(E10=\",\",\"\",E10))","v":"OR(AND(FALSE,"},{"$f":"IF(F10=\"\",\"\",E9&IF(F10=\",\",\"\",F10))","v":"OR(AND(FALSE,1),AND(FALSE,1)),"},{"$f":"IF(G10=\"\",\"\",F9&IF(G10=\",\",\"\",G10))","v":""},{"$f":"IF(H10=\"\",\"\",G9&IF(H10=\",\",\"\",H10))","v":""},{"$f":"IF(I10=\"\",\"\",H9&IF(I10=\",\",\"\",I10))","v":""},{"$f":"IF(J10=\"\",\"\",I9&IF(J10=\",\",\"\",J10))","v":""},{"$f":"IF(K10=\"\",\"\",J9&IF(K10=\",\",\"\",K10))","v":""},{"$f":"IF(L10=\"\",\"\",K9&IF(L10=\",\",\"\",L10))","v":""},{"$f":"IF(M10=\"\",\"\",L9&IF(M10=\",\",\"\",M10))","v":""},{"$f":"IF(N10=\"\",\"\",M9&IF(N10=\",\",\"\",N10))","v":""},{"$f":"IF(O10=\"\",\"\",N9&IF(O10=\",\",\"\",O10))","v":""},{"$f":"IF(P10=\"\",\"\",O9&IF(P10=\",\",\"\",P10))","v":""},{"$f":"IF(Q10=\"\",\"\",P9&IF(Q10=\",\",\"\",Q10))","v":""},null,{"$f":"IF(Sheet1!S9=\"\",\"\",Sheet1!S9)","v":""}]
[null,null,{"$f":"IFERROR(IF(Sheet1!C10=\"\",\"\",IF(Sheet1!C10=LINK,\"1,\",IF(Sheet1!C10=CHKON,VLOOKUP(Sheet1!C9,Sheet1!$V$5:$Y$37,4,0),NOT(VLOOKUP(Sheet1!C9,Sheet1!$V$5:$Y$37,4,0)))&\",\")),\"ERR\")","v":""},{"$f":"IF(D11,IF(C13=\"\",\"OR(AND(\",\"1),\"&D12&\"),\"),IF(D8,IF(C10=\"\",\"AND(\",\"1)\"),\",\"))","v":"OR(AND("},{"$f":"IFERROR(IF(Sheet1!E10=\"\",\"\",IF(Sheet1!E10=LINK,\"1,\",IF(Sheet1!E10=CHKON,VLOOKUP(Sheet1!E9,Sheet1!$V$5:$Y$37,4,0),NOT(VLOOKUP(Sheet1!E9,Sheet1!$V$5:$Y$37,4,0)))&\",\")),\"ERR\")","v":"FALSE,"},{"$f":"IF(F11,IF(E13=\"\",\"OR(AND(\",\"1),\"&F12&\"),\"),IF(F8,IF(E10=\"\",\"AND(\",\"1)\"),\",\"))","v":"1),AND(FALSE,1)),"},{"$f":"IFERROR(IF(Sheet1!G10=\"\",\"\",IF(Sheet1!G10=LINK,\"1,\",IF(Sheet1!G10=CHKON,VLOOKUP(Sheet1!G9,Sheet1!$V$5:$Y$37,4,0),NOT(VLOOKUP(Sheet1!G9,Sheet1!$V$5:$Y$37,4,0)))&\",\")),\"ERR\")","v":""},{"$f":"IF(H11,IF(G13=\"\",\"OR(AND(\",\"1),\"&H12&\"),\"),IF(H8,IF(G10=\"\",\"AND(\",\"1)\"),\",\"))","v":","},{"$f":"IFERROR(IF(Sheet1!I10=\"\",\"\",IF(Sheet1!I10=LINK,\"1,\",IF(Sheet1!I10=CHKON,VLOOKUP(Sheet1!I9,Sheet1!$V$5:$Y$37,4,0),NOT(VLOOKUP(Sheet1!I9,Sheet1!$V$5:$Y$37,4,0)))&\",\")),\"ERR\")","v":""},{"$f":"IF(J11,IF(I13=\"\",\"OR(AND(\",\"1),\"&J12&\"),\"),IF(J8,IF(I10=\"\",\"AND(\",\"1)\"),\",\"))","v":","},{"$f":"IFERROR(IF(Sheet1!K10=\"\",\"\",IF(Sheet1!K10=LINK,\"1,\",IF(Sheet1!K10=CHKON,VLOOKUP(Sheet1!K9,Sheet1!$V$5:$Y$37,4,0),NOT(VLOOKUP(Sheet1!K9,Sheet1!$V$5:$Y$37,4,0)))&\",\")),\"ERR\")","v":""},{"$f":"IF(L11,IF(K13=\"\",\"OR(AND(\",\"1),\"&L12&\"),\"),IF(L8,IF(K10=\"\",\"AND(\",\"1)\"),\",\"))","v":","},{"$f":"IFERROR(IF(Sheet1!M10=\"\",\"\",IF(Sheet1!M10=LINK,\"1,\",IF(Sheet1!M10=CHKON,VLOOKUP(Sheet1!M9,Sheet1!$V$5:$Y$37,4,0),NOT(VLOOKUP(Sheet1!M9,Sheet1!$V$5:$Y$37,4,0)))&\",\")),\"ERR\")","v":""},{"$f":"IF(N11,IF(M13=\"\",\"OR(AND(\",\"1),\"&N12&\"),\"),IF(N8,IF(M10=\"\",\"AND(\",\"1)\"),\",\"))","v":","},{"$f":"IFERROR(IF(Sheet1!O10=\"\",\"\",IF(Sheet1!O10=LINK,\"1,\",IF(Sheet1!O10=CHKON,VLOOKUP(Sheet1!O9,Sheet1!$V$5:$Y$37,4,0),NOT(VLOOKUP(Sheet1!O9,Sheet1!$V$5:$Y$37,4,0)))&\",\")),\"ERR\")","v":""},{"$f":"IF(P11,IF(O13=\"\",\"OR(AND(\",\"1),\"&P12&\"),\"),IF(P8,IF(O10=\"\",\"AND(\",\"1)\"),\",\"))","v":","},{"$f":"IFERROR(IF(Sheet1!Q10=\"\",\"\",IF(Sheet1!Q10=LINK,\"1\",IF(Sheet1!Q10=CHKON,VLOOKUP(Sheet1!Q9,Sheet1!$V$5:$Y$37,4,0),NOT(VLOOKUP(Sheet1!Q9,Sheet1!$V$5:$Y$37,4,0))))),\"ERR\")","v":""},{"$f":"IF(Q9=\"\",\"\",\"IFERROR(\"&Q9&$S$2)","v":""},0]
[null,true,null,{"$f":"Sheet1!D11=VLINK","v":true},null,{"$f":"Sheet1!F11=VLINK","v":true},null,{"$f":"Sheet1!H11=VLINK","v":false},null,{"$f":"Sheet1!J11=VLINK","v":false},null,{"$f":"Sheet1!L11=VLINK","v":false},null,{"$f":"Sheet1!N11=VLINK","v":false},null,{"$f":"Sheet1!P11=VLINK","v":false}]
[null,null,{"$f":"IF(C13=\"\",\"\",\"AND(\"&C13)","v":""},{"$f":"IF(D13=\"\",\"\",C12&IF(D13=\",\",\"\",D13))","v":"AND("},{"$f":"IF(E13=\"\",\"\",D12&IF(E13=\",\",\"\",E13))","v":"AND(FALSE,"},{"$f":"IF(F13=\"\",\"\",E12&IF(F13=\",\",\"\",F13))","v":"AND(FALSE,1)"},{"$f":"IF(G13=\"\",\"\",F12&IF(G13=\",\",\"\",G13))","v":""},{"$f":"IF(H13=\"\",\"\",G12&IF(H13=\",\",\"\",H13))","v":""},{"$f":"IF(I13=\"\",\"\",H12&IF(I13=\",\",\"\",I13))","v":""},{"$f":"IF(J13=\"\",\"\",I12&IF(J13=\",\",\"\",J13))","v":""},{"$f":"IF(K13=\"\",\"\",J12&IF(K13=\",\",\"\",K13))","v":""},{"$f":"IF(L13=\"\",\"\",K12&IF(L13=\",\",\"\",L13))","v":""},{"$f":"IF(M13=\"\",\"\",L12&IF(M13=\",\",\"\",M13))","v":""},{"$f":"IF(N13=\"\",\"\",M12&IF(N13=\",\",\"\",N13))","v":""},{"$f":"IF(O13=\"\",\"\",N12&IF(O13=\",\",\"\",O13))","v":""},{"$f":"IF(P13=\"\",\"\",O12&IF(P13=\",\",\"\",P13))","v":""},{"$f":"IF(Q13=\"\",\"\",P12&IF(Q13=\",\",\"\",Q13))","v":""},{"$f":"IF(Q13=\"\",\"\",Q12&R13)","v":""},{"$f":"IF(Sheet1!S12=\"\",\"\",Sheet1!S12)","v":""}]
[null,null,{"$f":"IFERROR(IF(Sheet1!C13=\"\",\"\",IF(Sheet1!C13=LINK,\"1,\",IF(Sheet1!C13=CHKON,VLOOKUP(Sheet1!C12,Sheet1!$V$5:$Y$37,4,0),NOT(VLOOKUP(Sheet1!C12,Sheet1!$V$5:$Y$37,4,0)))&\",\")),\"ERR\")","v":""},{"$f":"IF(D14,IF(C16=\"\",\"OR(AND(\",\"1),\"&D15&\"),\"),IF(D11,IF(C13=\"\",\"AND(\",\"1)\"),\",\"))","v":"AND("},{"$f":"IFERROR(IF(Sheet1!E13=\"\",\"\",IF(Sheet1!E13=LINK,\"1,\",IF(Sheet1!E13=CHKON,VLOOKUP(Sheet1!E12,Sheet1!$V$5:$Y$37,4,0),NOT(VLOOKUP(Sheet1!E12,Sheet1!$V$5:$Y$37,4,0)))&\",\")),\"ERR\")","v":"FALSE,"},{"$f":"IF(F14,IF(E16=\"\",\"OR(AND(\",\"1),\"&F15&\"),\"),IF(F11,IF(E13=\"\",\"AND(\",\"1)\"),\",\"))","v":"1)"},{"$f":"IFERROR(IF(Sheet1!G13=\"\",\"\",IF(Sheet1!G13=LINK,\"1,\",IF(Sheet1!G13=CHKON,VLOOKUP(Sheet1!G12,Sheet1!$V$5:$Y$37,4,0),NOT(VLOOKUP(Sheet1!G12,Sheet1!$V$5:$Y$37,4,0)))&\",\")),\"ERR\")","v":""},{"$f":"IF(H14,IF(G16=\"\",\"OR(AND(\",\"1),\"&H15&\"),\"),IF(H11,IF(G13=\"\",\"AND(\",\"1)\"),\",\"))","v":","},{"$f":"IFERROR(IF(Sheet1!I13=\"\",\"\",IF(Sheet1!I13=LINK,\"1,\",IF(Sheet1!I13=CHKON,VLOOKUP(Sheet1!I12,Sheet1!$V$5:$Y$37,4,0),NOT(VLOOKUP(Sheet1!I12,Sheet1!$V$5:$Y$37,4,0)))&\",\")),\"ERR\")","v":""},{"$f":"IF(J14,IF(I16=\"\",\"OR(AND(\",\"1),\"&J15&\"),\"),IF(J11,IF(I13=\"\",\"AND(\",\"1)\"),\",\"))","v":","},{"$f":"IFERROR(IF(Sheet1!K13=\"\",\"\",IF(Sheet1!K13=LINK,\"1,\",IF(Sheet1!K13=CHKON,VLOOKUP(Sheet1!K12,Sheet1!$V$5:$Y$37,4,0),NOT(VLOOKUP(Sheet1!K12,Sheet1!$V$5:$Y$37,4,0)))&\",\")),\"ERR\")","v":""},{"$f":"IF(L14,IF(K16=\"\",\"OR(AND(\",\"1),\"&L15&\"),\"),IF(L11,IF(K13=\"\",\"AND(\",\"1)\"),\",\"))","v":","},{"$f":"IFERROR(IF(Sheet1!M13=\"\",\"\",IF(Sheet1!M13=LINK,\"1,\",IF(Sheet1!M13=CHKON,VLOOKUP(Sheet1!M12,Sheet1!$V$5:$Y$37,4,0),NOT(VLOOKUP(Sheet1!M12,Sheet1!$V$5:$Y$37,4,0)))&\",\")),\"ERR\")","v":""},{"$f":"IF(N14,IF(M16=\"\",\"OR(AND(\",\"1),\"&N15&\"),\"),IF(N11,IF(M13=\"\",\"AND(\",\"1)\"),\",\"))","v":","},{"$f":"IFERROR(IF(Sheet1!O13=\"\",\"\",IF(Sheet1!O13=LINK,\"1,\",IF(Sheet1!O13=CHKON,VLOOKUP(Sheet1!O12,Sheet1!$V$5:$Y$37,4,0),NOT(VLOOKUP(Sheet1!O12,Sheet1!$V$5:$Y$37,4,0)))&\",\")),\"ERR\")","v":""},{"$f":"IF(P14,IF(O16=\"\",\"OR(AND(\",\"1),\"&P15&\"),\"),IF(P11,IF(O13=\"\",\"AND(\",\"1)\"),\",\"))","v":","},{"$f":"IFERROR(IF(Sheet1!Q13=\"\",\"\",IF(Sheet1!Q13=LINK,\"1\",IF(Sheet1!Q13=CHKON,VLOOKUP(Sheet1!Q12,Sheet1!$V$5:$Y$37,4,0),NOT(VLOOKUP(Sheet1!Q12,Sheet1!$V$5:$Y$37,4,0))))),\"ERR\")","v":""},{"$f":"IF(Q12=\"\",\"\",\"IFERROR(\"&Q12&$S$2)","v":""},0]
[null,true,null,{"$f":"Sheet1!D14=VLINK","v":false},null,{"$f":"Sheet1!F14=VLINK","v":false},null,{"$f":"Sheet1!H14=VLINK","v":false},null,{"$f":"Sheet1!J14=VLINK","v":false},null,{"$f":"Sheet1!L14=VLINK","v":false},null,{"$f":"Sheet1!N14=VLINK","v":false},null,{"$f":"Sheet1!P14=VLINK","v":false}]
[null,null,{"$f":"IF(C16=\"\",\"\",\"AND(\"&C16)","v":""},{"$f":"IF(D16=\"\",\"\",C15&IF(D16=\",\",\"\",D16))","v":""},{"$f":"IF(E16=\"\",\"\",D15&IF(E16=\",\",\"\",E16))","v":""},{"$f":"IF(F16=\"\",\"\",E15&IF(F16=\",\",\"\",F16))","v":""},{"$f":"IF(G16=\"\",\"\",F15&IF(G16=\",\",\"\",G16))","v":""},{"$f":"IF(H16=\"\",\"\",G15&IF(H16=\",\",\"\",H16))","v":""},{"$f":"IF(I16=\"\",\"\",H15&IF(I16=\",\",\"\",I16))","v":""},{"$f":"IF(J16=\"\",\"\",I15&IF(J16=\",\",\"\",J16))","v":""},{"$f":"IF(K16=\"\",\"\",J15&IF(K16=\",\",\"\",K16))","v":""},{"$f":"IF(L16=\"\",\"\",K15&IF(L16=\",\",\"\",L16))","v":""},{"$f":"IF(M16=\"\",\"\",L15&IF(M16=\",\",\"\",M16))","v":""},{"$f":"IF(N16=\"\",\"\",M15&IF(N16=\",\",\"\",N16))","v":""},{"$f":"IF(O16=\"\",\"\",N15&IF(O16=\",\",\"\",O16))","v":""},{"$f":"IF(P16=\"\",\"\",O15&IF(P16=\",\",\"\",P16))","v":""},{"$f":"IF(Q16=\"\",\"\",P15&IF(Q16=\",\",\"\",Q16))","v":""},null,{"$f":"IF(Sheet1!S15=\"\",\"\",Sheet1!S15)","v":""}]
{"$rows_left_out":23}