{"text_format":"1","workbook":"xlsx","n_sheets":2,"sheets":["Data","Drawing"],"not_rendered":{"charts":0,"images":0,"macros":1,"external_links":0,"defined_names":0,"comments":0,"pivot_tables":0},"unopened":[],"bounds":{"document_bytes":16777216,"sheet_cells":100000,"rows_first":2000,"rows_last":500,"rows_between":2000,"halvings":0,"cell_chars":16384,"cell_head_chars":4096},"cells_cut":0,"cells_raw":0,"read":"whole","date_system":"1900"}

{"sheet":"Data","index":0,"n_rows":6,"n_cols":14,"rows_kept":6,"cut":false,"hidden":false,"merged":[]}
["Loop Name","Description","Transmitter","Junction Box","JB Terminal","Cable","Core","Marshalling Rack","MR Terminal","PLC","PLC Tag","PLC Rack","PLC Slot","PLC Channel"]
["425-F-001","Feed Flow","425-FT-001","JB-001",1,"JB001-MR02",1,"MR02",6,"REACTOR","425-FI-001",2,1,1]
["425-F-002","Product Flow","425-FT-002","JB-001",2,"JB001-MR02",2,"MR02",7,"REACTOR","425-FI-002",2,1,2]
["425-L-001","Feed Level","425-LT-001","JB-001",3,"JB001-MR02",3,"MR02",8,"REACTOR","425-LI-001",2,2,1]
["425-P-001","Feed Pressure","425-PT-001","JB-001",4,"JB001-MR02",4,"MR02",9,"REACTOR","425-PI-001",2,3,3]
["425-P-002","Product Pressure","425-PT-002","JB-001",5,"JB001-MR02",5,"MR02",10,"REACTOR","425-PI-002",2,3,4]

{"sheet":"Drawing","index":1,"n_rows":36,"n_cols":14,"rows_kept":36,"cut":false,"hidden":false,"merged":[[32,0,32,2],[32,8,32,9],[33,8,33,9],[33,11,35,15],[34,8,34,9],[35,6,35,10],[5,0,5,2],[31,12,31,14],[30,12,30,14],[1,1,1,9],[1,10,1,14],[7,7,7,8],[29,11,29,15],[30,8,30,9],[31,8,31,9],[26,7,26,8],[29,8,29,9]]}
[]
[null,"FIELD",null,null,null,null,null,null,null,null,"REMOTE INSTRUMENT ENCLOSURE"]
[]
[]
[]
[{"$f":"VLOOKUP(M31,Data!A:C,3,FALSE)","v":"425-PT-002"},null,null,null,null,{"$f":"VLOOKUP(M31,Data!A:D,4,FALSE)","v":"JB-001"},null,null,null,null,{"$f":"VLOOKUP(M31,Data!A:H,8,FALSE)","v":"MR02"},null,"PLC",{"$f":"VLOOKUP(M31,Data!A:N,10,FALSE)","v":"REACTOR"}]
[null,null,null,null,null,null,null,null,null,null,null,null,"PLC Tag",{"$f":"VLOOKUP(M31,Data!A:N,11,FALSE)","v":"425-PI-002"}]
[null,"+",null,null,null,{"$f":"VLOOKUP(M31,Data!A:E,5,FALSE)&\"+\"","v":"5+"},null,{"$f":"VLOOKUP(M31,Data!A:F,6,FALSE)","v":"JB001-MR02"},null,null,{"$f":"VLOOKUP(M31,Data!A:I,9,FALSE)&\"+\"","v":"10+"},null,"Rack",{"$f":"VLOOKUP(M31,Data!A:N,12,FALSE)","v":2}]
[null,"-",null,null,null,{"$f":"VLOOKUP(M31,Data!A:E,5,FALSE)&\"-\"","v":"5-"},null,"Core #",{"$f":"VLOOKUP(M31,Data!A:G,7,FALSE)","v":5},null,{"$f":"VLOOKUP(M31,Data!A:I,9,FALSE)&\"-\"","v":"10-"},null,"Slot",{"$f":"VLOOKUP(M31,Data!A:N,13,FALSE)","v":3}]
[null,null,null,null,null,null,null,null,null,null,null,null,"Channel",{"$f":"VLOOKUP(M31,Data!A:N,14,FALSE)","v":4}]
[]
[]
[]
[]
[]
[]
[]
[]
[]
[]
[]
[]
[]
[]
[]
[]
[]
[]
[]
["NOTES:",null,null,null,null,null,null,null,null,null,null,"Loop Drawing"]
["Cable Shields to be grounded at the ",null,null,null,null,null,null,null,null,null,null,null,"425-P-002"]
["marshalling ground terminal point",null,null,null,null,null,null,null,null,null,null,null,{"$f":"VLOOKUP(M31,Data!A:B,2,FALSE)","v":"Product Pressure"}]
[]
[null,null,null,null,null,null,0,"NM","APPROVED",null,"2013-03-13","www.Engineers-Excel.com"]
[null,null,null,null,null,null,"REV #","BY","COMMENT",null,"DATE"]
[null,null,null,null,null,null,"REVISION DETAILS"]